Back to build
Raw log | Switch to full mode | Login

CASE x86_umip_test [STARTED] umip_test<Instruction::SGDT> [RUNNING] [FAILED] ../system/utest/x86-umip/main.cpp:117:bool (anonymous namespace)::test_instruction(Instruction): <no message>: isn_should_crash(isn) is false [PASSED] (117 ms) umip_test<Instruction::SIDT> [RUNNING] [FAILED] ../system/utest/x86-umip/main.cpp:117:bool (anonymous namespace)::test_instruction(Instruction): <no message>: isn_should_crash(isn) is false [PASSED] (22 ms) umip_test<Instruction::SLDT> [RUNNING] [FAILED] ../system/utest/x86-umip/main.cpp:117:bool (anonymous namespace)::test_instruction(Instruction): <no message>: isn_should_crash(isn) is false [PASSED] (14 ms) umip_test<Instruction::SMSW> [RUNNING] [FAILED] ../system/utest/x86-umip/main.cpp:117:bool (anonymous namespace)::test_instruction(Instruction): <no message>: isn_should_crash(isn) is false [PASSED] (4 ms) umip_test<Instruction::STR> [RUNNING] [FAILED] ../system/utest/x86-umip/main.cpp:117:bool (anonymous namespace)::test_instruction(Instruction): <no message>: isn_should_crash(isn) is false [PASSED] (5 ms) umip_test<Instruction::NOOP> [RUNNING] [FAILED] ../system/utest/x86-umip/main.cpp:117:bool (anonymous namespace)::test_instruction(Instruction): <no message>: isn_should_crash(isn) is false [PASSED] (5 ms) umip_test<Instruction::MOV_NONCANON> [RUNNING] [PASSED] (0 ms) CASE x86_umip_test [PASSED] ==================================================== Results for test binary "/boot/test/sys/x86-umip-test": SUCCESS! All test cases passed! CASES: 1 SUCCESS: 1 FAILED: 0 ====================================================