Back to build
Raw log | Switch to full mode | Login

[57229/57230] LINK ./unit_tests FAILED: unit_tests python "../../build/toolchain/gcc_link_wrapper.py" --output="./unit_tests" -- ../../third_party/llvm-build/Release+Asserts/bin/clang++ -Wl,--fatal-warnings -fPIC -Wl,-z,noexecstack -Wl,-z,relro -Wl,-z,now -fuse-ld=lld -Wl,--color-diagnostics -m64 -Werror -Wl,-O2 -Wl,--gc-sections -rdynamic -nostdlib++ --sysroot=../../build/linux/debian_sid_amd64-sysroot -L../../build/linux/debian_sid_amd64-sysroot/usr/local/lib/x86_64-linux-gnu -L../../build/linux/debian_sid_amd64-sysroot/lib/x86_64-linux-gnu -L../../build/linux/debian_sid_amd64-sysroot/usr/lib/x86_64-linux-gnu -fsanitize=memory -pie -Wl,--disable-new-dtags -Wl,-R,\$ORIGIN/instrumented_libraries_prebuilt/msan/lib -Wl,-z,origin -Wl,-R,________________________________________________________________________________________________PADDING________________________________________________________________________________________________ -Wl,-u_sanitizer_options_link_helper -fsanitize=memory -o "./unit_tests" -Wl,--start-group @"./unit_tests.rsp" -Wl,--end-group -ldl -lpthread -lrt -lgio-2.0 -lgobject-2.0 -lglib-2.0 -lgnome-keyring -lgmodule-2.0 -lgthread-2.0 -lnss3 -lnssutil3 -lsmime3 -lplds4 -lplc4 -lnspr4 -lgtk-3 -lgdk-3 -latk-1.0 -lpangocairo-1.0 -lgdk_pixbuf-2.0 -lcairo-gobject -lpango-1.0 -lcairo -ldbus-1 -luuid -lX11 -lX11-xcb -lxcb -lXcomposite -lXcursor -lXdamage -lXext -lXfixes -lXi -lXrender -lXtst -lcups -lexpat -lXrandr -lresolv -lasound -lm -lz -lpci -latk-bridge-2.0 -latspi -lXss ld.lld: error: failed to open ./unit_tests: No space left on device clang-9: error: linker command failed with exit code 1 (use -v to see invocation)