Back to build
Raw log | Switch to full mode | Login

{ "failures": [ { "dependencies": [], "output": "python \"../../build/toolchain/gcc_link_wrapper.py\" --output=\"./chrome\" -- ../../third_party/llvm-build/Release+Asserts/bin/clang++ -Wl,--fatal-warnings -fPIC -Wl,-z,noexecstack -Wl,-z,relro -Wl,-z,now -fuse-ld=lld -Wl,--color-diagnostics -m64 -Werror -Wl,-O2 -Wl,--gc-sections -rdynamic -nostdlib++ --sysroot=../../build/linux/debian_sid_amd64-sysroot -L../../build/linux/debian_sid_amd64-sysroot/usr/local/lib/x86_64-linux-gnu -L../../build/linux/debian_sid_amd64-sysroot/lib/x86_64-linux-gnu -L../../build/linux/debian_sid_amd64-sysroot/usr/lib/x86_64-linux-gnu -fsanitize=vptr -fsanitize-coverage=trace-pc-guard -pie -Wl,--disable-new-dtags -Wl,-u_sanitizer_options_link_helper -fsanitize=vptr -fsanitize-coverage=trace-pc-guard -o \"./chrome\" -Wl,--start-group @\"./chrome.rsp\" -Wl,--end-group -ldl -lpthread -lrt -lX11 -lX11-xcb -lxcb -lXcomposite -lXcursor -lXdamage -lXext -lXfixes -lXi -lXrender -lXtst -lgmodule-2.0 -lgobject-2.0 -lgthread-2.0 -lglib-2.0 -lnss3 -lnssutil3 -lsmime3 -lplds4 -lplc4 -lnspr4 -lcups -ldbus-1 -lXss -lexpat -luuid -lXrandr -lresolv -lgio-2.0 -lasound -lm -lz -lpci -lpangocairo-1.0 -lpango-1.0 -lcairo -latk-1.0 -latk-bridge-2.0 -latspi -lgtk-3 -lgdk-3 -lgdk_pixbuf-2.0 -lcairo-gobject\nld.lld: error: undefined symbol: typeinfo for send_tab_to_self::ReceivingUiHandler\n>>> referenced by send_tab_to_self_client_service.cc\n>>> browser/send_tab_to_self_client_service.o:(.data..L__unnamed_9+0x18) in archive obj/chrome/browser/libbrowser.a\n\nld.lld: error: undefined symbol: typeinfo for send_tab_to_self::ReceivingUiHandler\n>>> referenced by receiving_ui_handler_registry.cc\n>>> browser/receiving_ui_handler_registry.o:(.data..L__unnamed_1+0x18) in archive obj/chrome/browser/libbrowser.a\nclang: error: linker command failed with exit code 1 (use -v to see invocation)\n", "output_nodes": [ "chrome" ], "rule": "LINK" } ], "warnings": [] }