Back to build
Raw log | Switch to full mode | Login

Test 'dEQP.GLES2/functional_buffer_write_partial_specify_whole_2' completed with the following status(es): 'FAILURE','FAILURE','FAILURE' Test 'dEQP.GLES2/functional_buffer_write_partial_specify_whole_2' had the following logs when run: ================================================================================ ../../third_party/angle/src/tests/deqp_support/angle_deqp_gtest.cpp:35 Failed DebugReportCallback(316): [ VUID-vkCmdBindVertexBuffers-pOffsets-00626 ] Object: 0x5de (Type = 9) | vkCmdBindVertexBuffers() offset (0x10da0) is beyond the end of the buffer. The Vulkan spec states: All elements of pOffsets must be less than the size of the corresponding element in pBuffers (https://www.khronos.org/registry/vulkan/specs/1.1-extensions/html/vkspec.html#VUID-vkCmdBindVertexBuffers-pOffsets-00626) ../../third_party/angle/src/tests/deqp_support/angle_deqp_gtest.cpp:35 Failed DebugReportCallback(316): [ UNASSIGNED-CoreValidation-DrawState-InvalidVtxAttributeAlignment ] Object: 0x552 (Type = 9) | Invalid attribAddress alignment for vertex attribute 0 from pipeline (0x5e5) and vertex buffer (0x552). ../../third_party/angle/src/tests/deqp_support/angle_deqp_gtest.cpp:367 Value of: testPassed Actual: false Expected: true ../../third_party/angle/src/tests/deqp_support/angle_deqp_gtest.cpp:367 Value of: testPassed Actual: false Expected: true ../../third_party/angle/src/tests/deqp_support/angle_deqp_gtest.cpp:35 Failed DebugReportCallback(316): [ UNASSIGNED-CoreValidation-DrawState-InvalidVtxAttributeAlignment ] Object: 0x68 (Type = 9) | Invalid attribAddress alignment for vertex attribute 0 from pipeline (0x70) and vertex buffer (0x68). ../../third_party/angle/src/tests/deqp_support/angle_deqp_gtest.cpp:367 Value of: testPassed Actual: false Expected: true ================================================================================