Back to build
Raw log | Switch to full mode | Login

Test 'dEQP.GLES2/functional_buffer_write_basic_element_array_static_draw' completed with the following status(es): 'FAILURE','FAILURE','FAILURE' Test 'dEQP.GLES2/functional_buffer_write_basic_element_array_static_draw' had the following logs when run: ================================================================================ ../../third_party/angle/src/tests/deqp_support/angle_deqp_gtest.cpp:35 Failed DebugReportCallback(316): [ UNASSIGNED-CoreValidation-DrawState-InvalidVtxAttributeAlignment ] Object: 0x224 (Type = 9) | Invalid attribAddress alignment for vertex attribute 0 from pipeline (0x2af) and vertex buffer (0x224). ../../third_party/angle/src/tests/deqp_support/angle_deqp_gtest.cpp:367 Value of: testPassed Actual: false Expected: true ../../third_party/angle/src/tests/deqp_support/angle_deqp_gtest.cpp:35 Failed DebugReportCallback(316): [ UNASSIGNED-CoreValidation-DrawState-InvalidVtxAttributeAlignment ] Object: 0x68 (Type = 9) | Invalid attribAddress alignment for vertex attribute 0 from pipeline (0x70) and vertex buffer (0x68). ../../third_party/angle/src/tests/deqp_support/angle_deqp_gtest.cpp:367 Value of: testPassed Actual: false Expected: true ../../third_party/angle/src/tests/deqp_support/angle_deqp_gtest.cpp:35 Failed DebugReportCallback(316): [ UNASSIGNED-CoreValidation-DrawState-InvalidVtxAttributeAlignment ] Object: 0x64 (Type = 9) | Invalid attribAddress alignment for vertex attribute 0 from pipeline (0xc0) and vertex buffer (0x64). ../../third_party/angle/src/tests/deqp_support/angle_deqp_gtest.cpp:367 Value of: testPassed Actual: false Expected: true ================================================================================