Back to build
Raw log | Switch to full mode | Login

Test 'TextureFunctionTest.NonConstantOffset' completed with the following status(es): 'FAILURE','SUCCESS' Test 'TextureFunctionTest.NonConstantOffset' had the following logs when run: ================================================================================ [ RUN ] TextureFunctionTest.NonConstantOffset ../../third_party/angle/src/tests/compiler_tests/TextureFunction_test.cpp(69): error: Failed Shader compilation failed with sample function texelFetchOffset(s, ivec2(samplePos.xy), 0, ivec2(0, 0)), expecting success: ERROR: 0:1: '310' : integer overflow ERROR: 0:3: 'out' : storage qualifier supported in GLSL ES 3.00 and above only WARNING: 0:9: '0' : Integer overflow WARNING: 0:9: '0' : Integer overflow WARNING: 0:9: '0' : Integer overflow ERROR: 0:9: 'texelFetchOffset' : no matching overloaded function found ERROR: 0:9: '=' : dimension mismatch ERROR: 0:9: 'assign' : cannot convert from 'const mediump float' to 'out mediump 4-component vector of float' Stack trace: Backtrace: base::debug::StackTrace::StackTrace [0x00007FFD0895C275+37] StackTraceGetter::CurrentStackTrace [0x00007FF64CC23786+86] testing::internal::UnitTestImpl::CurrentOsStackTraceExceptTop [0x00007FF64CC3A89A+90] testing::internal::AssertHelper::operator= [0x00007FF64CC3A377+87] [ FAILED ] TextureFunctionTest.NonConstantOffset (697 ms) [ RUN ] TextureFunctionTest.NonConstantOffset [ OK ] TextureFunctionTest.NonConstantOffset (22 ms) ================================================================================